{"text_format":"1","workbook":"xlsx","n_sheets":7,"sheets":["Wheels Calculator","Wheel_Tire_Data","Weight Variables - Wheels","2 Tracks Calculator","Weight Variables -2 Track","4 Tracks Calculator","Weight Variables - 4 Track"],"not_rendered":{"charts":0,"images":3,"macros":1,"external_links":4,"defined_names":185,"comments":9,"pivot_tables":0},"unopened":[],"bounds":{"document_bytes":16777216,"sheet_cells":100000,"rows_first":2000,"rows_last":500,"rows_between":2000,"halvings":0,"cell_chars":16384,"cell_head_chars":4096},"cells_cut":0,"cells_raw":0,"read":"whole","date_system":"1900"}

{"sheet":"Wheels Calculator","index":0,"n_rows":81,"n_cols":14,"rows_kept":81,"cut":false,"hidden":false,"merged":[[8,11,17,11],[46,3,46,5],[47,3,47,5],[33,2,35,2],[33,6,35,6],[31,7,31,9],[32,7,32,9],[44,8,45,8],[43,7,43,9],[43,3,43,5],[44,3,44,5],[4,3,4,5],[5,3,5,5],[4,7,4,9],[5,7,5,9],[28,1,28,3],[28,5,28,9],[27,1,27,3],[27,5,27,9],[25,1,25,3],[119,5,120,5],[46,8,47,8],[45,3,45,5],[37,11,43,11],[26,1,26,3],[37,3,37,9],[38,8,39,8],[40,8,41,8],[33,8,35,8],[29,8,30,8],[42,1,44,1],[38,4,39,4],[40,4,41,4],[38,6,39,6],[40,6,41,6],[37,1,39,1]]}
[]
[]
[]
[]
[null,null,null,"Customer Name:",null,null,null,"Name of analysis:"]
[null,null,null,"Customer",null,null,null,"Application"]
[]
[null," Model:",null,"Emission Level:",null," Transmission:",null," Front Axle:",null," Rear Axle:"]
[null,"8R 370",null,"Final Tier 4/ Stage 5",null,"e23",null,"1300 MFWD",null,"120mm x 3012mm (Double Taper)"]
["(kg)",{"$f":"_xlfn.IFNA(INDEX('Weight Variables - Wheels'!B27:B34,MATCH('Wheels Calculator'!B9,'Weight Variables - Wheels'!B3:B10,0)),0)","v":370},null,{"$f":"_xlfn.IFNA(INDEX('Weight Variables - Wheels'!C27:C30,MATCH('Wheels Calculator'!D9,'Weight Variables - Wheels'!C3:C6,0)),0)","v":1504},null,{"$f":"_xlfn.IFNA(INDEX('Weight Variables - Wheels'!D27:D30,MATCH('Wheels Calculator'!F9,'Weight Variables - Wheels'!D3:D6,0)),0)","v":1167.8},null,{"$f":"INDEX('Weight Variables - Wheels'!E28:E31,MATCH('Wheels Calculator'!H9,FrontAxle,0))","v":1044.3510100000001},null,{"$f":"_xlfn.IFNA(INDEX('Weight Variables - Wheels'!F27:F33,MATCH(J9,'Weight Variables - Wheels'!F3:F9,0)),0)","v":494.61}]
["(mm)",5300,null,{"$f":"_xlfn.IFNA(INDEX('Weight Variables - Wheels'!C59:C61,MATCH('Wheels Calculator'!D9,'Weight Variables - Wheels'!C4:C6,0)),0)","v":-2967.8050000000003},null,{"$f":"_xlfn.IFNA(INDEX(mm_Trans, MATCH(F9,Trans,0)),0)","v":-1977},null,{"$f":"_xlfn.IFNA(INDEX('Weight Variables - Wheels'!E59:E62,MATCH('Wheels Calculator'!H9,FrontAxle,0)),0)","v":-3050},null,0]
[null,-880,null,null,null,"16 PST not available for 345hp or 370hp models ",null,"1300 not available for 320/345/370/410hp models ",null,"110mm options not available for 320/345/370/410hp models"]
[]
[null,"Front Fenders:",null,"Rear Fenders:",null,"Front PTO:",null,"Trailer Brakes:",null,"Fuel Level:"]
[null,"500mm (19.7in)",null,"2.55m",null,"Not Included",null,"Dual line Air",null,"Half "]
{"$rows_left_out":67}
{"sheet":"Wheel_Tire_Data","index":1,"n_rows":134,"n_cols":43,"rows_kept":134,"cut":false,"hidden":true,"merged":[[100,27,100,29],[2,32,2,33],[2,34,2,35],[2,36,2,38],[0,1,1,4],[100,1,100,4],[100,9,100,10],[2,7,2,8],[2,9,2,10],[2,11,2,13],[2,14,2,16],[2,17,2,19],[100,33,100,34],[0,8,0,23],[0,27,0,42]]}
[null,"Do not add rows above or below. To input new tires replace \"x\" in lower rows",null,null,null,null,"No R2 Tread included",null,"Rear",null,null,null,null,null,null,null,null,null,null,null,null,null,null,null,null,null,null,"Front"]
[]
[null,null,null,null,null,null,null,"Tire",null,"Single Wheel ",null,"Dual/Dual Wheel",null,null,"Dual/Trip Wheel",null,null,"Triple Wheel",null,null,null,null,null,null,null,null,null,null,null,null,null,null,"Tire",null,"Single Wheel ",null,"Dual/Dual Wheel"]
[null,null,"Tire Size","Section width","Brand","Group","Load Rating","PN","Mass (kg)","PN","Weight","Size","PN","Weight","Size","PN","Weight","Size","PN","Weight","Single Mass","Dual/D Mass","Dual/T mass","Triple Mass",null,null,null,"Tire Size","Section width","Brand","Group","Load Rating","PN","Mass (kg)","PN","Weight","Size","PN","Weight","Single Mass","Dual/D Mass","Dual/T mass","Triple Mass"]
[null,"Rear","320/105R54",{"$f":"MID(C5,FIND(\"/\",C5)-3,3)","v":"320"},"Goodyear","Group 48",163,"R345492",155,"RE564283",81,{"$f":"C5","v":"320/105R54"},"RE564284",145,{"$f":"C5","v":"320/105R54"},"RE564284",145,{"$f":"C5","v":"320/105R54"},"RE564284",145,{"$f":"(2*I5)+(2*K5)","v":472},{"$f":"IFERROR((2*N5)+(2*I5)+IF(D5>800,$D$103,($D$103+$D$104)),\"\")","v":747},{"$f":"IFERROR((2*I5)+(2*Q5)+IF(D5>800,$D$103,($D$103+$D$104)),\"\")","v":747},{"$f":"IFERROR((2*I5)+(2*T5),\"\")","v":600},null,null,null,"320/80R42",{"$f":"MID(AB5,FIND(\"/\",AB5)-3,3)","v":"320"},"Goodyear","Group 43",141,"R333095",93,"RE558176",139,{"$f":"AB5","v":"320/80R42"},"RE558178",141.6,{"$f":"IFERROR((AJ5*2)+(AH5*2),\"\")","v":464},{"$f":"IFERROR(((AH5*2)+(AM5*2))+$AC$108,\"\")","v":469.2}]
[null,"Rear","IF710/70R42","710","Michelin","Group 48",179,"R248946",348,"RE283141",175.05,{"$f":"C6","v":"IF710/70R42"},"RE262592",264.36,"Not Available","NA","NA","Not Available","NA","NA",1046.0999999999999,1371.72,"","",null,null,null,"IF320/80R42",{"$f":"MID(AB6,FIND(\"/\",AB6)-3,3)","v":"320"},"Goodyear","Group 43",149,"R538505",100,"RE558176",144,"IF320/80R42","RE558178",141.6,{"$f":"IFERROR((AJ6*2)+(AH6*2),\"\")","v":488},{"$f":"IFERROR(((AH6*2)+(AM6*2))+$AC$108,\"\")","v":483.2}]
[null,"Rear","320/90R54","320","Firestone","Group 47",149,"R171126",140,"RE161991",190,{"$f":"C7","v":"320/90R54"},"RE211636",254.77,{"$f":"C7","v":"320/90R54"},"RE211636",254.77,{"$f":"C7","v":"320/90R54"},"RE211636",254.77,660,936.54,936.54,789.54,null,null,null,"380/80R38",{"$f":"MID(AB7,FIND(\"/\",AB7)-3,3)","v":"380"},"Mitas","Group 43",142,"R333095",96,"RE589286",105.36,"380/80R38","RE589284",111,{"$f":"IFERROR((AJ7*2)+(AH7*2),\"\")","v":402.72},{"$f":"IFERROR(((AH7*2)+(AM7*2))+$AC$108,\"\")","v":414}]
[null,"Rear","320/90R54","320","Goodyear","Group 47",149,"R171125",109,"RE161991",190,{"$f":"C8","v":"320/90R54"},"RE211636",254.77,{"$f":"C8","v":"320/90R54"},{"$f":"M8","v":"RE211636"},254.77,{"$f":"C8","v":"320/90R54"},"RE211636",254.77,598,874.54,874.54,727.54,null,null,null,"380/80R38","380","Firestone","Group 43",142,"R186620",121,"RE589286",105.36,"380/80R38","RE589284",111,452.72,{"$f":"IFERROR(((AH8*2)+(AM8*2))+$AC$108,\"\")","v":464}]
[null,"Rear","380/90R50","380","Firestone","Group 47",151,"R150849",153,"RE172186",129,"380/90R50","RE172939",257.39999999999998,"380/90R50","RE172939",257.39999999999998,"380/90R50","RE172939",257.39999999999998,564,967.8,967.8,820.8,null,null,null,"IF380/80R38","380","Firestone","Group 43",149,"R325308",139,"RE589286",105.36,"IF380/80R38","RE589284",111,488.72,500]
[null,"Rear","380/90R50","380","Goodyear","Group 47",151,"R566170",153,"RE172186",129,"380/90R50","RE172939",257.39999999999998,"380/90R50","RE172939",257.39999999999998,"380/90R50","RE172939",257.39999999999998,564,967.8,967.8,820.8,null,null,null,"380/80R38","380","Goodyear","Group 43",142,"R171118",98,"RE589286",105.36,"380/80R38","RE589284",111,406.72,418]
[null,"Rear","380/90R54","380","Firestone","Group 48",152,"R542548",165,"RE223670",201.5,{"$f":"C11","v":"380/90R54"},"RE211235",252.7,"Not Available","NA","NA","Not Available","NA","NA",733,982.4,"","",null,null,null,"380/80R38","380","Michelin","Group 43",142,"L220846",95,"RE589286",105.36,"380/80R38","RE589284",111,400.72,412]
[null,"Rear","380/90R54","380","Goodyear","Group 48",152,"R223672",165,"RE223670",201.5,"380/90R54","RE211235",252.7,"Not Available","NA","NA","Not Available","NA","NA",733,982.4,"","",null,null,null,"IF380/80R38","380","Goodyear","Group 43",149,"R569945",113,"RE589286",105.36,"IF380/80R38","RE589284",111,436.72,448]
[null,"Rear","480/80R46","480","Mitas","Group 47",158,"R554863",178,"RE175533",122.23,"480/80R46","RE214650",167.65,{"$f":"C13","v":"480/80R46"},"RE167955",197.74,{"$f":"C13","v":"480/80R46"},"RE214650",167.65,600.46,838.3,898.48,691.3,null,null,null,"380/80R38","380","Trelleborg","Group 43",142,"R569958",117,"RE589286",105.36,"380/80R38","RE589284",111,444.72,456]
[null,"Rear","480/80R46","480","Goodyear","Group 47",158,"R569949",196,"RE175533",122.23,"480/80R46","RE214650",167.65,{"$f":"C14","v":"480/80R46"},"RE167955",197.74,{"$f":"C14","v":"480/80R46"},"RE214650",167.65,636.46,874.3,934.48,727.3,null,null,null,"380/85R34","380","Mitas","Group 42",145,"R554852",95,"RE171021",112.71,"380/85R34","RE588915",107.5,415.41999999999996,405]
[null,"Rear","480/80R46","480","Trelleborg","Group 47",158,"R555810",185,"RE175533",122.23,"480/80R46","RE214650",167.65,"Not Available",null,null,"Not Available",null,null,614.46,852.3,517,370,null,null,null,"380/85R34","380","Firestone","Group 42",137,"R224601",112,"RE171021",112.71,"380/85R34","RE588915",107.5,449.41999999999996,439]
{"$rows_left_out":120}
{"sheet":"Weight Variables - Wheels","index":2,"n_rows":138,"n_cols":43,"rows_kept":138,"cut":false,"hidden":true,"merged":[[24,29,25,29],[55,20,56,20],[55,21,56,21],[55,27,56,27],[55,28,56,28],[55,22,56,22],[55,23,56,23],[55,24,56,24],[55,25,56,25],[55,26,56,26],[55,0,56,0],[55,1,56,1],[55,3,56,3],[55,4,56,4],[55,5,56,5],[0,29,1,29],[24,24,25,24],[24,13,25,13],[24,28,25,28],[0,11,1,11],[0,26,1,26],[0,27,1,27],[0,28,1,28],[0,23,1,23],[0,25,1,25],[0,24,1,24],[0,13,1,13],[0,12,1,12],[0,20,1,20],[24,23,25,23],[24,25,25,25],[0,0,1,0],[24,1,25,1],[24,3,25,3],[24,8,24,10],[0,1,1,1],[0,3,1,3],[0,8,0,10],[0,4,1,4],[0,6,0,7],[24,6,24,7],[24,4,25,4],[0,5,1,5],[24,0,25,0],[24,5,25,5],[23,2,23,27],[24,21,25,21],[0,14,1,14],[24,26,25,26],[24,27,25,27],[24,11,25,11],[24,14,25,14],[24,15,25,15],[24,16,24,19],[24,20,25,20],[24,12,25,12],[24,22,25,22],[0,21,1,21],[0,22,1,22],[0,15,1,15],[0,16,0,19],[124,3,124,4],[105,5,105,6],[105,7,105,8],[0,2,1,2],[24,2,25,2],[55,2,56,2],[105,1,105,2],[54,2,54,27],[55,6,55,7],[55,8,55,10],[55,11,56,11],[55,12,56,12],[55,13,56,13],[55,14,56,14],[55,15,56,15],[55,16,55,19]]}
["Option #","Tractor Model","Emissions Level","Transmission","Front Axle","Rear Axle (diameter, 2438 or 3012 mm length)","Front Wheel Assemblies",null,"Rear Wheel Assemblies",null,null,"Front Fenders","Rear Fenders","Front PTO","Front Weight Support","Front Suitcase Weights (NA)","Rear Wheel Weights",null,null,null,"Pick-up (Monster) Weights ","Front Hitch (3 point)","Rear Hitch","Drawbar","Pickup / Wagon Hitch","Trailer Brakes","Air Trailer Brake, Single Line","Fuel Level (0.85 kg/L)","# of SCVs","Ballast Package"]
[null,null,null,null,null,null,"Single","Dual","Single","Dual","Triple",null,null,null,null,null,"Inside Drive","Outside Drive","Outside Dual/Triple","Configurations",null,null,null,null,null,null,null,null,null,null,72,205,625,530,970,"550+900","front support","suitcase weights"]
[null," "," "," "," "," "," "," "," "," "," "," "," "," "," "," "," "," "," "," "," "," "," "," "," "," "," "," "," ",null,null,null,null,null,null,null,null,null,null,"Rim Size","Duals","Singles","Double Flat"]
[1,"8R 230","Final Tier 4/ Stage 5","16 speed","1300 MFWD","110mm x 3012mm (Single Taper)","N/A","N/A","N/A","N/A","N/A","No Fenders","No Extensions","Not Included","Not Included","Front Hitch (No Front Weight Support)","Not Included","Not Included","Not Included","Not Included","Not Included","Not Included","  ","Not Included","Not Included","Not Included","Not Included","Empty","4 w/out Hitch","None"]
[2,"8R 250","Tier 3A/ Stage 3","e23","1500 MFWD","110mm x 3012mm (Double Taper)",null,null,null,null,null,"500mm (19.7in)","2.55m","Included","Included","Front Weight Support, No Weights","625 kg (1378 lb)","70kg (154 lb)+530kg(1169 lb)","70kg (154 lb)+530kg(1169 lb)","Not compatible with 60 inch treads","900 kg","Included","CAT 3, Quick Coupler","CAT 3","Wagon Hitch, Piton"," Dual line Air ","Included","23 GAL",4,"820kg (1808lb)","One Pair","One Pair","None",null,"None",null,"Included","None","Includes Front Weight Support with No Front Suitcase Weights, Two Pair 205 kg (452 lb.) Inside/Inner Rear Wheel Weights, and No Outside/Outer Dual Rear Wheel Weights."]
[3,"8R 280","Tier 2/ Stage 2","IVT ","ILS (</= 320 hp)","120mm x 2438mm (Double Taper)",null,null,null,null,null,"620mm (24.1in)","2.75m",null,null,"4 x 43kg (North America)","205 kg (452 lb)","70kg (154 lb)+900kg(1985 lb)","70kg (154 lb)+900kg(1985 lb) lb)","No compatible < 42 in rims","1150 kg",null,"CAT 3, Quick Coupler (Hydraulic)","CAT 4","Wagon Hitch, Ball","Dual line Air & Hydraulic",null,"Half ",5,"1940 kg (4277 lb) - For Duals","One Pair","None","One Pair",null,"None",null,"Included",4,"Includes Front Weight Support with No Front Suitcase Weights, No Inside/Inner Rear Wheel Weights and One Pair 70 kg (154 lb.) with One Pair 900 kg (1984 lb.) Outside/Outer Dual Rear Wheel Weights","X","X"]
[4,"8R 310",null,null,"ILS (>320 hp)","120mm x 2550mm (Double Flat)",null,null,null,null,null,"720mm (28.35in)",null,null,null,"8 x 43kg (North America)","2x205 kg (904 lb)","72kg (159 lb)+205kg(452 lb)","70kg (154 lb)+550kg (1213 lb)+900kg (1985 lb)","Requires Double Flat axle","1500 kg",null,"CAT 3, Hook w/ Sway Blocks","CAT 4 HD","Wagon Hitch, Pin","Dual Line Hydraulic",null,"Full ",6,"2450 kg (5401 lb) - For Duals","One Pair","One Pairs","One Pair",null,"None",null,"Included",8,"Includes Front Weight Support with No Front Suitcase Weights, One Pair 625 kg (1378 lb.) Inside/Inner Rear Wheel Weights, and One Pair 70 kg (154 lb.) with One Pair 530 kg (1168 lb.) Outside/Outer Dual Rear Wheel Weights.","X","X"]
[5,"8R 340",null,null,null,"120mm x 3012mm (Double Taper)",null,null,null,null,null,null,null,null,null,"12 x 43kg (North America)","72kg +(2x205 kg) (2126 lb)","72kg (159 lb)+(2x205kg) (904 lb)","72kg (159 lb)+205kg(452 lb)","Wheel not compatible < 42 & Requires a Double Flat axle","1800 kg",null,"CAT 3, Hook w/ Sway Blocks (Hydraulic)","3 in 1 CAT 3","Drawbar Support Insert",null,null,null,"5 (4+1 Hi-Flow Coup) ","3795 kg (8367 lb) - For Duals","One Pair","Three Pairs","One Pair",null,"None",null,"Included",16,"Includes Front Weight Support with Four Front Suitcase Weights, One Pair 205 kg (452 lb.) Inside/Inner Rear Wheel Weights, One Pair 70 kg (154 lb.) with One Pair 550 kg (1213 lb.), and One Pair 900 kg (1984 lb.) Outside/Outer Dual Rear Wheel Weights.","X","X"]
[6,"8R 370",null,null,null,"120mm x 3012mm (Double Flat)",null,null,null,null,null,null,null,null,null,"16 x 43kg (North America)",null,"72kg (159 lb)+(3x205kg) (1356 lb)","72kg (159 lb)+(2x205kg) (904 lb)","Not compatible with Duals or Triples",null,null,"CAT 3, Hook w/ Stabilizer","3 in 1 CAT 4",null,null,null,null,null,"5409 kg (11925 lb) - For Duals","One Pair","Three Pairs","One Pair",null,"None",null,"Included",22,"Includes Front Weight Support with 22 Front Suitcase Weights, One Pair 625 kg (1378 lb.) Inside/Inner Rear Wheel Weights, One Pair 70 kg (154 lb.), with One Pair 550 kg (1213 lb.), and One Pair 900 kg (1984 lb.) Outside/Outer Dual Rear Wheel Weights. ","X","X"]
[7,"8R 410",null,null,null,null,null,null,null,null,null,null,null,null,null,"22 x 43kg (North America)",null,null,"72kg (159 lb)+(3x205kg) (1356 lb)","Outside Drive Ballast Not Compatible with Duals or Triples. ",null,null,"CAT 4, Quick Coupler","Pickup Hitch",null,null,null,null,null,"3723 kg (8208 lb) - For Singles",null,null,null,null,null,null,null,null,"Includes Front Weight Support with 22 Front Suitcase Weights, One Pair 625 kg (1378 lb.) Inner Rear Wheel Weights, and One Pair 70 kg (154 lb.) with One Pair 530 kg (1168 lb.) Outer Rear Wheel Weights.","X",null,"X","X"]
[8,null,null,null,null,null,null,null,null,null,null,null,null,null,null,"4 x 50kg (Europe, Asia)",null,null,null,"Not Compatible with Single Tire Configurations",null,null,"CAT 4, Quick Coupler (Hydrualic)",null,null,null,null,null,null,"4463 kg (9839 lb) - For Singles",null,null,null,null,null,null,null,null,"Includes Front Weight Support with 22 Front Suitcase Weights, One Pair 625 kg (1378 lb.) Inner Rear Wheel Weights, and One Pair 70 kg (154 lb.) with One Pair 900 kg (1984 lb.) Outer Rear Wheel Weights.","X",null,"X","X"]
[9,null,null,null,null,null,null,null,null,null,null,null,null,null,null,"8 x 50kg (Europe, Asia)",null,null,null,"Requires Double flat axle and 42in, 46in, or 50in rims",null,null,"CAT 4, Hook w/ Sway Blocks",null,null,null,null,null,null,"2623 kg (5783 lb) - For Singles",null,null,null,null,null,null,null,null,"Includes Front Weight Support with No Front Suitcase Weights, One Pair 625 kg (1378 lb.) Inner Rear Wheel Weights, and One Pair 70 kg (154 lb.) with One Pair 530 kg (1168 lb.) Outer Rear Wheel Weights.","X",null,"X","X"]
[10,null,null,null,null,null,null,null,null,null,null,null,null,null,null,"12 x 50kg (Europe, Asia)",null,null,null,"Requires Double Flat Axle",null,null,"CAT 4, Hook w/ Sway Blocks (Hydraulic)",null,null,null,null,null,null,"3363 kg (7414 lb) - For Singles",null,null,null,null,null,null,null,null,"Includes Front Weight Support with No Front Suitcase Weights, One Pair 625 kg (1378 lb.) Inner Rear Wheel Weights, and One Pair 70 kg (154 lb.) with One Pair 900 kg (1984 lb.) Outer Rear Wheel Weights.","X",null,"X","X"]
[11,null,null,null,null,null,null,null,null,null,null,null,null,null,null,"16 x 50kg (Europe, Asia)",null,null,null,"Requires 42in, 46in, or 50in diameter wheels",null,null,"CAT 4, Hook w/ Stabilizers"]
[12,null,null,null,null,null,null,null,null,null,null,null,null,null,null,"22 x 50kg (Europe, Asia)",null,null,null,"Additional ballast not compatible with ballast packages",null,null,"CAT 4, Hook w/ Stabilizers (Hydraulic)"]
{"$rows_left_out":124}
{"sheet":"2 Tracks Calculator","index":3,"n_rows":53,"n_cols":10,"rows_kept":53,"cut":false,"hidden":false,"merged":[[4,3,4,5],[4,7,4,9],[5,3,5,5],[5,7,5,9],[20,7,20,9],[20,1,20,3],[23,7,23,9],[24,7,24,9],[21,7,21,9],[25,7,25,9],[21,5,22,5],[22,7,22,9]]}
[]
[]
[]
[]
[null,null,null,"Customer Name:",null,null,null,"Name of analysis:"]
[null,null,null,"Customer",null,null,null,"Application"]
[]
[]
[null," Model:",null,"Emissions level:",null," Transmission:",null,"Max Tread Setting:",null," Rear Drive Wheels:"]
[null,"RT 370",null,"Final Tier 4/ Stage 5",null,"IVT",null,"96in/120in (2038mm/3048mm)",null,"Standard"]
["(kg)",{"$f":"RIGHT(B10,3)*1","v":370},null,{"$f":"INDEX('Weight Variables -2 Track'!N22:N24,MATCH(_23_PST,'Weight Variables -2 Track'!N3:N5,0))","v":1504},null,{"$f":"INDEX('Weight Variables -2 Track'!C22:C23,MATCH('2 Tracks Calculator'!F10,'Weight Variables -2 Track'!C3:C4,0))","v":1319.73},null,{"$f":"INDEX(kg_RearAxleT,MATCH(H10,RearAxleT,0))","v":1511},null,{"$f":"INDEX(kg_RearDriveWheels, MATCH(J10,RearDriveWheels,0))","v":741.89}]
["(mm)",6700,null,{"$f":"F12","v":-2388},null,{"$f":"INDEX(mm_TransT, MATCH(F10,TransT,0))","v":-2388},null,{"$f":"INDEX(mm_RearAxleT,MATCH(H10,RearAxleT,0))","v":-689},null,{"$f":"INDEX(mm_RearDriveWheels, MATCH(J10,RearDriveWheels,0))","v":0}]
[null,-950]
[]
[null,"Rear Hitch:",null,"Drawbar:",null,"SCVs:",null,"Fuel Level:",null,"Tracks:"]
{"$rows_left_out":39}
{"sheet":"Weight Variables -2 Track","index":4,"n_rows":72,"n_cols":20,"rows_kept":72,"cut":false,"hidden":true,"merged":[[55,17,55,18],[55,14,55,15],[55,11,55,12],[0,13,1,13],[18,2,18,13],[19,13,20,13],[37,2,37,13],[38,13,39,13],[55,8,55,9],[38,5,39,5],[38,6,39,6],[38,7,39,7],[38,8,39,8],[38,9,39,9],[38,10,39,10],[38,11,39,11],[38,12,39,12],[19,11,20,11],[18,0,20,0],[19,7,20,7],[19,8,20,8],[19,9,20,9],[19,10,20,10],[37,0,39,0],[38,1,39,1],[38,2,39,2],[38,3,39,3],[38,4,39,4],[19,6,20,6],[19,1,20,1],[19,2,20,2],[0,0,1,0],[0,1,1,1],[0,2,1,2],[0,3,1,3],[0,4,1,4],[0,9,1,9],[19,3,20,3],[19,4,20,4],[19,5,20,5],[0,14,1,14],[0,11,1,11],[0,12,1,12],[0,10,1,10],[0,5,1,5],[0,6,1,6],[0,7,1,7],[0,8,1,8],[19,12,20,12]]}
["Option #","Tractor Model","Transmission","Tracks","Rear Drive Wheels","Max Tread Setting ","Front Weight Support","Front Suitcase Weights (NA)","Idler Weights","Drawbar","Rear Hitch","Fuel Level (758 L capacity at 0.85 kg/L)","# of SCV's","Emission Levels","Configurations"]
[]
[1,"RT 310","e23","16in (406mm), 6500","Standard","96in/120in (2038mm/3048mm)","Not Included","No Front Weight Support","None","Not Included","CAT 4, Quick Coupler","Empty",4,"Final Tier 4/ Stage 5","Vehicle exceeds Max Ballast Weight of 17,700kg (39,000lb)"]
[2,"RT 340","IVT","18in (457mm), 4500","Wide","160in (4064mm)","Included","Front Weight Support, No Weights","146kg (323 lb) -  4x36kg (80lb) Weights","CAT 4","CAT 4, Hook w/ Sway Blocks","23 GAL",5,"Tier 3/ Stage 3"]
[3,"RT 370",null,"18in (457mm), 6500",null,null,null,"4 x 43kg (North America)","432kg (953lb) - 4x36kg (80lb) + 4x72kg (159lb) ","CAT 4 HD",null,"Half",6,"Tier 2/ Stage 2 engine"]
[4,"RT 410",null,"24in (610mm), 4500",null,null,null,"8 x 43kg (North America)","1252kg (2760 lb) -  4x36kg (80lb) + 4x72kg (159lb) + 4x205kg (452lb)",null,null,"Full","5 (4+1 Hi-Flow Coup)"]
[5,null,null,"25in (635mm), 4500",null,null,null,"12 x 43kg (North America)"]
[6,null,null,"25in (635mm), 6500",null,null,null,"16 x 43kg (North America)"]
[7,null,null,"30in (762mm), 4500",null,null,null,"22 x 43kg (North America)"]
[8,null,null,"30in (762mm), 6500",null,null,null,"34 x 43kg (22 + 12 \"cheek\" weights)"]
[9]
[10]
[11]
[12]
[]
{"$rows_left_out":58}
{"sheet":"4 Tracks Calculator","index":5,"n_rows":65,"n_cols":10,"rows_kept":65,"cut":false,"hidden":false,"merged":[[27,8,29,8],[4,3,4,5],[5,3,5,5],[25,5,25,7],[26,5,26,7],[27,5,27,7],[28,5,28,7],[29,5,29,7],[35,1,35,3],[31,5,31,7],[36,1,36,3],[31,1,31,3],[32,1,32,3],[33,1,33,3],[34,1,34,3]]}
[]
[]
[]
[]
[null,null,null,"Customer Name:",null,null,null,"Name of analysis:"]
[null,null,null,"Customer",null,null,null,"Application"]
[]
[null," Model:",null," Emissions level:",null," Transmission:",null,"Tread Setting"]
[null,"RX 370",null,"Final Tier 4/ Stage 5",null,"e23",null,"120in (3048mm)"]
["(kg)",{"$f":"RIGHT(B9,3)*1","v":370},null,{"$f":"INDEX('Weight Variables - 4 Track'!C22:C24,MATCH('4 Tracks Calculator'!D9,'Weight Variables - 4 Track'!C3:C5,0))","v":1504},null,{"$f":"INDEX('Weight Variables - 4 Track'!D22:D23,MATCH('4 Tracks Calculator'!F9,'Weight Variables - 4 Track'!D3:D4,0))","v":1163.5},null,{"$f":"INDEX('Weight Variables - 4 Track'!N22:N25,MATCH('4 Tracks Calculator'!H9,'Weight Variables - 4 Track'!N3:N6,0))","v":2885}]
["(mm)",5880,null,{"$f":"INDEX('Weight Variables - 4 Track'!C41:C43,MATCH('4 Tracks Calculator'!D9,'Weight Variables - 4 Track'!C3:C5,0))","v":-3152.8049999999998},null,{"$f":"INDEX('Weight Variables - 4 Track'!D41:D42,MATCH('4 Tracks Calculator'!F9,'Weight Variables - 4 Track'!D3:D4,0))","v":-2162},null,{"$f":"INDEX('Weight Variables - 4 Track'!N41:N44,MATCH('4 Tracks Calculator'!H9,'Weight Variables - 4 Track'!N3:N6,0))","v":-1739}]
[null,-1200,null,"16 PST not available for 345hp or 370hp models ",null,"16 PST not available for 345hp or 370hp models "]
[]
[null," Front Hitch:",null," Rear Hitch:",null," Drawbar:",null,"3 in 1 Rails Option:"]
[null,"Not Included",null,"CAT 4, Quick Coupler",null,"CAT 4 HD",null,"Not Included"]
{"$rows_left_out":51}
{"sheet":"Weight Variables - 4 Track","index":6,"n_rows":81,"n_cols":22,"rows_kept":81,"cut":false,"hidden":true,"merged":[[69,4,69,5],[69,2,69,3],[0,15,1,15],[0,6,1,6],[0,7,1,7],[0,8,1,8],[56,10,56,11],[56,13,56,14],[0,14,1,14],[0,9,1,9],[0,11,1,11],[0,10,1,10],[0,12,1,12],[56,16,56,17],[56,19,56,20],[19,7,20,7],[19,9,20,9],[19,13,20,13],[19,11,20,11],[19,8,20,8],[19,12,20,12],[19,10,20,10],[38,10,39,10],[37,0,39,0],[38,1,39,1],[38,3,39,3],[38,5,39,5],[38,9,39,9],[38,6,39,6],[38,7,39,7],[38,8,39,8],[38,4,39,4],[38,2,39,2],[37,3,37,14],[38,14,39,14],[38,11,39,11],[38,12,39,12],[38,13,39,13],[18,0,20,0],[19,1,20,1],[19,3,20,3],[19,5,20,5],[19,2,20,2],[19,4,20,4],[18,3,18,14],[19,6,20,6],[0,0,1,0],[0,1,1,1],[0,3,1,3],[0,5,1,5],[0,2,1,2],[0,4,1,4]]}
["Option #","Tractor Model","Emissions Levels","Transmission","Front Tracks","Rear Tracks","Front Suitcase Weights (NA)","Drawbar","3in1 Rails Option","Rear Hitch","Trailer Brakes ","Fuel Level (758 L capacity at 0.85 kg/L)","# of SCV's","Tread Settings","Front Hitch ","Configuration"]
[]
[1,"RX 310","Final Tier 4/ Stage 5","e23","16in (406.4mm)","16in (406.4mm)","Front Hitch (No Front Weight Support)","Not Included","Not Included","CAT 4, Quick Coupler","Not Included","Empty",4,"76in (1930mm)","Not Included","Vehicle exceeds Max Ballast Weight of 20,000kg (44,100lb)"]
[2,"RX 340","Tier 3/ Stage 3","IVT ","18in (457.2mm)","18in (457.2mm)","Front Weight Support, No Starter Weight, No Suitcase Weights","CAT 4","Wagon Hitch, Piton","CAT 4, Quick Coupler (Hydraulic)"," Dual line Air ","23 GAL",5,"80in (2032mm)","Included"]
[3,"RX 370",null,null,"24in (609.6mm)","24in (609.6mm)","Front Weight Support with Starter Weight, No Suitcase Weights","CAT 4 HD","Wagon Hitch, Ball","CAT 4, Hook w/ Sway Blocks","Dual line Air & Hydraulic","Half",6,"88in (2235mm)"]
[4,"RX 410",null,null,null,"30in (762mm)","Front Weight Support with Starter Weight and 8 Suitcase Weights","3 in 1 CAT 3","Wagon Hitch, Pin","CAT 4, Hook w/ Stabilizers (Hydraulic)","Dual Line Hydraulic","Full","5 (4+1 Hi-Flow Coup)","120in (3048mm)"]
[5,null,null,null,null,null,"Front Weight Support with Starter Weight and 12 Suitcase Weights","3 in 1 CAT 4","Drawbar support insert","CAT 4, Hook w/ Stabilizers"]
[6,null,null,null,null,null,"Front Weight Support with Starter Weight and 18 Suitcase Weights","Pickup Hitch",null,"CAT 4, Hook w/ Stabilizers (Hydraulic)"]
[7]
[8]
[9]
[10]
[11]
[12]
[]
{"$rows_left_out":66}